{"text_format":"1","workbook":"xlsx","n_sheets":8,"sheets":["VAT Guidance","Analysis Code Guidance","IMPREST CLAIM","GL07","Reconciliation","Unpresented cheque list","_GL07_55","Module1"],"not_rendered":{"charts":0,"images":1,"macros":1,"external_links":0,"defined_names":3,"comments":0,"pivot_tables":0},"unopened":[{"sheet":"Module1","index":7,"reason":"part_missing"}],"bounds":{"document_bytes":16777216,"sheet_cells":100000,"rows_first":2000,"rows_last":500,"rows_between":2000,"halvings":0,"cell_chars":16384,"cell_head_chars":4096},"cells_cut":0,"cells_raw":0,"read":"whole","date_system":"1900"}

{"sheet":"VAT Guidance","index":0,"n_rows":7,"n_cols":2,"rows_kept":7,"cut":false,"hidden":false,"merged":[]}
[]
["VAT Code","Description"]
["P5","Standard Rate (20%)"]
["P0","VAT Out of Scope (0%)\nSome goods and services are outside the VAT tax system so you can’t charge or reclaim the VAT on them. For example, out of scope items include:\n\n-Goods or services you buy and use outside of the EU\n-Statutory fees - like the London congestion charge\n-Goods you sell as part of a hobby - like stamps from a collection\n-Donations to a charity - if given without receiving anything in return\n-Companies that are not VAT registered"]
["P3","VAT Zero Rated (0%)\nZero-rated items are goods on which the Government charge VAT but the rate is currently set to zero. The goods covered by this classification are items such as children’s clothes and footwear, public transport, water, basic foods, books and newspapers."]
["P2","VAT Exempt (0%)\nExempt items are goods on which no VAT is paid or charged, but which still need to be recorded on the VAT Return. The goods covered by this classification are items such as land, postal services, health services, betting and gaming."]
["P8","VAT Reduced Rate (5%)\nMainly Domestic Fuel"]

{"sheet":"Analysis Code Guidance","index":1,"n_rows":1650,"n_cols":7,"rows_kept":1650,"cut":false,"hidden":false,"merged":[]}
[]
["You can filter by the Account Code you have entered and then select the relevant Analysis Code to add to Column H in the Invoice Lines Tab"]
[]
[]
["Account","Account Code Name","Analysis Code","Description",null,"Account"]
["A11010","Agency Social Workers","AGSW-001","Social Worker - Sickness Cover",null,"A11010","Yes - Please Add to Column L"]
["A11010","Agency Social Workers","AGSW-002","Social Worker - Maternity Cover",null,"A11011","Yes - Please Add to Column L"]
["A11010","Agency Social Workers","AGSW-003","Social Worker - Vacancy Cover",null,"A11015","Yes - Please Add to Column L"]
["A11010","Agency Social Workers","AGSW-004","Social Worker - Additional Post",null,"A20000","Yes - Please Add to Column L"]
["A11010","Agency Social Workers","DM-AY","DM - Agency",null,"A20001","Yes - Please Add to Column L"]
["A11011","Agency Nursing Staff","AGNS-001","Nursing Staff - Sickness Cover",null,"A20005","Yes - Please Add to Column L"]
["A11011","Agency Nursing Staff","AGNS-002","Nursing Staff - Maternity Cover",null,"A20006","Yes - Please Add to Column L"]
["A11011","Agency Nursing Staff","AGNS-003","Nursing Staff - Vacancy Cover",null,"A20010","Yes - Please Add to Column L"]
["A11011","Agency Nursing Staff","AGNS-004","Nursing Staff - Additional Post",null,"A20015","Yes - Please Add to Column L"]
["A11015","Other Agency Staff","AGOS-001","Team Manager - Sickness Cover",null,"A20020","Yes - Please Add to Column L"]
["A11015","Other Agency Staff","AGOS-002","Team Manager - Maternity Cover",null,"A20021","Yes - Please Add to Column L"]
["A11015","Other Agency Staff","AGOS-003","Team Manager - Additional Post",null,"A89045","Yes - Please Add to Column L"]
["A11015","Other Agency Staff","AGOS-004","Team Manager - Vacancy Cover",null,"A89120","Yes - Please Add to Column L"]
["A11015","Other Agency Staff","AGOS-005","Service Manager - Sickness Cover",null,"A89125","Yes - Please Add to Column L"]
["A11015","Other Agency Staff","AGOS-006","Service Manager - Maternity Cover",null,"A89130","Yes - Please Add to Column L"]
["A11015","Other Agency Staff","AGOS-007","Service Manager - Additional Post",null,"A89135","Yes - Please Add to Column L"]
["A11015","Other Agency Staff","AGOS-008","Service Manager - Vacancy Cover",null,"A90901","Yes - Please Add to Column L"]
["A11015","Other Agency Staff","AGOS-009","Administrative and Clerical - Sickness Cover",null,"A90902","Yes - Please Add to Column L"]
["A11015","Other Agency Staff","AGOS-010","Administrative and Clerical - Maternity Cover",null,"A91185","Yes - Please Add to Column L"]
["A11015","Other Agency Staff","AGOS-011","Administrative and Clerical - Additional Post",null,"A91186","Yes - Please Add to Column L"]
["A11015","Other Agency Staff","AGOS-012","Administrative and Clerical - Vacancy Cover",null,"B14000","Yes - Please Add to Column L"]
["A11015","Other Agency Staff","AGOS-013","Officer - Sickness Cover",null,"B14005","Yes - Please Add to Column L"]
["A11015","Other Agency Staff","AGOS-014","Officer - Maternity Cover",null,"B16000","Yes - Please Add to Column L"]
["A11015","Other Agency Staff","AGOS-015","Officer - Additional Post",null,"B21005","Yes - Please Add to Column L"]
["A11015","Other Agency Staff","AGOS-016","Officer - Vacancy Cover",null,"B21010","Yes - Please Add to Column L"]
{"$rows_left_out":1621}
{"sheet":"IMPREST CLAIM","index":2,"n_rows":200,"n_cols":25,"rows_kept":200,"cut":false,"hidden":false,"merged":[[9,12,10,12],[7,11,8,11],[7,10,8,10],[9,0,10,0],[9,1,10,1],[9,2,10,2],[9,3,10,3],[7,7,7,9],[7,6,8,6],[9,11,10,11],[9,7,10,7],[9,8,10,8],[9,9,10,9],[9,10,10,10]]}
["Imprest Reimburesement Claim"]
[]
[]
[null,null,null,null,null,null,null,null,null,null,null,null,null,null,null,null,null,"P5","PA","P5","P2","P8","P0","P3",0]
[null,null,null,null,null,null,null,null,null,null,null,null,null,null,null,null,null,"P0",0.88888888888888884,0.83333299999999999,1,{"$f":"100/105","v":0.95238095238095233},1,1,1]
["Your Business World Supplier Imprest ID","Supplier Name",null,null,"Refund of Amounts Spent During The Period To",null,null,null,null,null,null,null,null,null,null,null,null,"P3"]
[null,null,null,null,null,null,null,null,null,null,null,null,null,null,null,null,null,"P2"]
[null,null,null,null,null,null,"Please refer to VAT Guidance Tab","Invoice Total:-",null,null,{"$f":"IF(H9=(I9+J9),\"OK to PAY\",\"Totals Don’t Match\")","v":"OK to PAY"},"Please refer to Analysis Code Tab",null,null,null,null,null,"P8"]
[null,null,null,null,null,null,null,{"$f":"SUM(H12:H200)","v":0},{"$f":"SUM(I12:I200)","v":0},{"$f":"SUM(J12:J200)","v":0},null,null,null,null,null,null,null,"PA"]
["Supplier Name","Method of Payment:\nCash or \nCheque No","Type of Supply\ne.g Equipment, Books, Materials etc","Voucher \nControl \nNo","Cost Centre","Account Code","VAT Code","Total of Invoice Including VAT","Amount of Invoice Excluding VAT","Amount of VAT","Analysis Code Required?","Please add your analysis code here if it is required","Additional Notes"]
[null,null,null,null,"CC","(Subjective)","P5 = 20% (Standard Rate)\nP0 = Non Business / Out of Scope\nP3 = Zero Rated\nP2 = Exempt (Only use P2 for postage, rents and health service)\nP8 = 5% Reduced Rate \nPA = 12.5% Temporary Rate"]
[null,null,null,null,null,null,null,null,{"$f":"ROUND(H12*HLOOKUP(G12,$S$4:$Y$5,2,0),2)","v":0},{"$f":"H12-I12","v":0},{"$f":"IF(ISERROR(VLOOKUP(F12,'Analysis Code Guidance'!F:G,2,FALSE)),\"No - Leave Column L Blank\",(VLOOKUP(F12,'Analysis Code Guidance'!F:G,2,FALSE)))","v":"No - Leave Column L Blank"},null,{"$f":"IF(G12=\"P2\",\"Only use P2 for Postage, Rents and Health Services\",\"\")","v":""}]
[null,null,null,null,null,null,null,null,{"$f":"ROUND(H13*HLOOKUP(G13,$S$4:$Y$5,2,0),2)","v":0},{"$f":"H13-I13","v":0},{"$f":"IF(ISERROR(VLOOKUP(F13,'Analysis Code Guidance'!F:G,2,FALSE)),\"No - Leave Column L Blank\",(VLOOKUP(F13,'Analysis Code Guidance'!F:G,2,FALSE)))","v":"No - Leave Column L Blank"},null,{"$f":"IF(G13=\"P2\",\"Only use P2 for Postage, Rents and Health Services\",\"\")","v":""}]
[null,null,null,null,null,null,null,null,0,{"$f":"H14-I14","v":0},{"$f":"IF(ISERROR(VLOOKUP(F14,'Analysis Code Guidance'!F:G,2,FALSE)),\"No - Leave Column L Blank\",(VLOOKUP(F14,'Analysis Code Guidance'!F:G,2,FALSE)))","v":"No - Leave Column L Blank"},null,""]
[null,null,null,null,null,null,null,null,0,0,{"$f":"IF(ISERROR(VLOOKUP(F15,'Analysis Code Guidance'!F:G,2,FALSE)),\"No - Leave Column L Blank\",(VLOOKUP(F15,'Analysis Code Guidance'!F:G,2,FALSE)))","v":"No - Leave Column L Blank"},null,""]
[null,null,null,null,null,null,null,null,0,0,{"$f":"IF(ISERROR(VLOOKUP(F16,'Analysis Code Guidance'!F:G,2,FALSE)),\"No - Leave Column L Blank\",(VLOOKUP(F16,'Analysis Code Guidance'!F:G,2,FALSE)))","v":"No - Leave Column L Blank"},null,""]
[null,null,null,null,null,null,null,null,0,0,{"$f":"IF(ISERROR(VLOOKUP(F17,'Analysis Code Guidance'!F:G,2,FALSE)),\"No - Leave Column L Blank\",(VLOOKUP(F17,'Analysis Code Guidance'!F:G,2,FALSE)))","v":"No - Leave Column L Blank"},null,""]
[null,null,null,null,null,null,null,null,0,0,{"$f":"IF(ISERROR(VLOOKUP(F18,'Analysis Code Guidance'!F:G,2,FALSE)),\"No - Leave Column L Blank\",(VLOOKUP(F18,'Analysis Code Guidance'!F:G,2,FALSE)))","v":"No - Leave Column L Blank"},null,""]
[null,null,null,null,null,null,null,null,0,0,{"$f":"IF(ISERROR(VLOOKUP(F19,'Analysis Code Guidance'!F:G,2,FALSE)),\"No - Leave Column L Blank\",(VLOOKUP(F19,'Analysis Code Guidance'!F:G,2,FALSE)))","v":"No - Leave Column L Blank"},null,""]
[null,null,null,null,null,null,null,null,0,0,{"$f":"IF(ISERROR(VLOOKUP(F20,'Analysis Code Guidance'!F:G,2,FALSE)),\"No - Leave Column L Blank\",(VLOOKUP(F20,'Analysis Code Guidance'!F:G,2,FALSE)))","v":"No - Leave Column L Blank"},null,""]
[null,null,null,null,null,null,null,null,0,0,{"$f":"IF(ISERROR(VLOOKUP(F21,'Analysis Code Guidance'!F:G,2,FALSE)),\"No - Leave Column L Blank\",(VLOOKUP(F21,'Analysis Code Guidance'!F:G,2,FALSE)))","v":"No - Leave Column L Blank"},null,""]
[null,null,null,null,null,null,null,null,0,0,{"$f":"IF(ISERROR(VLOOKUP(F22,'Analysis Code Guidance'!F:G,2,FALSE)),\"No - Leave Column L Blank\",(VLOOKUP(F22,'Analysis Code Guidance'!F:G,2,FALSE)))","v":"No - Leave Column L Blank"},null,""]
[null,null,null,null,null,null,null,null,0,0,{"$f":"IF(ISERROR(VLOOKUP(F23,'Analysis Code Guidance'!F:G,2,FALSE)),\"No - Leave Column L Blank\",(VLOOKUP(F23,'Analysis Code Guidance'!F:G,2,FALSE)))","v":"No - Leave Column L Blank"},null,""]
[null,null,null,null,null,null,null,null,0,0,{"$f":"IF(ISERROR(VLOOKUP(F24,'Analysis Code Guidance'!F:G,2,FALSE)),\"No - Leave Column L Blank\",(VLOOKUP(F24,'Analysis Code Guidance'!F:G,2,FALSE)))","v":"No - Leave Column L Blank"},null,""]
[null,null,null,null,null,null,null,null,0,0,{"$f":"IF(ISERROR(VLOOKUP(F25,'Analysis Code Guidance'!F:G,2,FALSE)),\"No - Leave Column L Blank\",(VLOOKUP(F25,'Analysis Code Guidance'!F:G,2,FALSE)))","v":"No - Leave Column L Blank"},null,""]
[null,null,null,null,null,null,null,null,0,0,{"$f":"IF(ISERROR(VLOOKUP(F26,'Analysis Code Guidance'!F:G,2,FALSE)),\"No - Leave Column L Blank\",(VLOOKUP(F26,'Analysis Code Guidance'!F:G,2,FALSE)))","v":"No - Leave Column L Blank"},null,""]
[null,null,null,null,null,null,null,null,0,0,{"$f":"IF(ISERROR(VLOOKUP(F27,'Analysis Code Guidance'!F:G,2,FALSE)),\"No - Leave Column L Blank\",(VLOOKUP(F27,'Analysis Code Guidance'!F:G,2,FALSE)))","v":"No - Leave Column L Blank"},null,""]
[null,null,null,null,null,null,null,null,0,0,{"$f":"IF(ISERROR(VLOOKUP(F28,'Analysis Code Guidance'!F:G,2,FALSE)),\"No - Leave Column L Blank\",(VLOOKUP(F28,'Analysis Code Guidance'!F:G,2,FALSE)))","v":"No - Leave Column L Blank"},null,""]
[null,null,null,null,null,null,null,null,0,0,{"$f":"IF(ISERROR(VLOOKUP(F29,'Analysis Code Guidance'!F:G,2,FALSE)),\"No - Leave Column L Blank\",(VLOOKUP(F29,'Analysis Code Guidance'!F:G,2,FALSE)))","v":"No - Leave Column L Blank"},null,""]
[null,null,null,null,null,null,null,null,0,0,{"$f":"IF(ISERROR(VLOOKUP(F30,'Analysis Code Guidance'!F:G,2,FALSE)),\"No - Leave Column L Blank\",(VLOOKUP(F30,'Analysis Code Guidance'!F:G,2,FALSE)))","v":"No - Leave Column L Blank"},null,""]
{"$rows_left_out":171}
{"sheet":"GL07","index":3,"n_rows":1168,"n_cols":26,"rows_kept":1168,"cut":false,"hidden":false,"merged":[]}
["type","GL07_55","Agresso Format 55"]
["filename",{"$f":"C19","v":0}]
[]
["default","interface","BR"]
["default","voucher_type","IR"]
["default","trans_type","GL"]
["default","status","N"]
["default","apar_type","P",null,null,null,null,null,null,null,null,null,null,null,null,null,null,null,null,null,null,null,null,null,null," "]
["default","tax_code",0]
["default","currency","GBP"]
["default","client",{"$f":"C20","v":"SC"}]
["default","batch_id",{"$f":"C21","v":"APREG20250225"}]
["default","trans_date",{"$f":"C22","v":"2025-02-25"}]
["default","voucher_date",{"$f":"C23","v":"2025-02-25"}]
[]
[null,"AP Registration BIF Upload",null,null,null,null,null,null,null,null,null,null,null,null,null,"Check against Imprest Form",{"$f":"IF(Q17='IMPREST CLAIM'!H9,\"Y\",\"N\")","v":"Y"}]
[null,null,null,null,null,null,null,null,null,null,null,{"$f":"M28","v":0},"Imprest",{"$f":"TODAY()","v":"2025-02-25"},"SupplierID+Imprest+Date","GL",{"$f":"SUM(P29:P200)","v":0}]
[null,"Parameters",null,null,null,null,null,null,null,null,null,null,null,null,null,"AP",{"$f":"P28","v":0}]
[null,"Filename",null,null,null,null,null,null,null,null,null,null,null,null,null,"Check",{"$f":"Q17+Q18","v":0}]
[null,"Client","SC"]
[null,"Batch ID",{"$f":"\"APREG\" & TEXT(TODAY(),\"YYYYMMDD\")","v":"APREG20250225"}]
[null,"Transaction Date",{"$f":"TODAY()","v":"2025-02-25"}]
[null,"Invoice Date",{"$f":"TODAY()","v":"2025-02-25"}]
[]
[]
[null,"Voucher No.","AP/GL","Account","Cost Centre","Project","Work Order","Cat5","Cat6","Tax Code","Tax System","Due Date","Supplier ID","Invoice No.","Description","Amount","Check"]
["columns","voucher_no","trans_type","account","dim_1","dim_2","dim_4","dim_5","dim_6","tax_code","tax_system","due_date","apar_id","ext_inv_ref","description","cur_amount"]
[{"$f":"IF(AND(Q28=\"Blank\",Q27=\"OK\"),\"end\",\"\")","v":""},1,"AP",{"$f":"UPPER(Z28)","v":"B32000"},90000,null,null,"ZZ",null,0,null,{"$f":"TODAY()","v":"2025-02-25"},{"$f":"'IMPREST CLAIM'!$A$7","v":0},{"$f":"IF(Q28=\"OK\",$L$17&\" \"&$M$17&\" \"&TEXT($N$17,\"dd/mm/yy\"),\"\")","v":"0 Imprest 25/02/25"},{"$f":"N28","v":"0 Imprest 25/02/25"},{"$f":"-SUM(P29:P200)","v":0},"OK",null,null,null,null,null,null,null,null,"B32000"]
[{"$f":"IF(AND(Q29=\"Blank\",Q28=\"OK\"),\"end\",\"\")","v":"end"},1,"GL",{"$f":"UPPER(Z29)","v":""},{"$f":"IF('IMPREST CLAIM'!E12=0,\"\",'IMPREST CLAIM'!E12)","v":""},null,null,{"$f":"IF('IMPREST CLAIM'!L12=0,\"\",'IMPREST CLAIM'!L12)","v":""},null,{"$f":"IF('IMPREST CLAIM'!G12=\"\",\"\",IF('IMPREST CLAIM'!G12=\"P0\",\"0\",'IMPREST CLAIM'!G12))","v":""},null,{"$f":"TODAY()","v":"2025-02-25"},{"$f":"'IMPREST CLAIM'!$A$7","v":0},{"$f":"IF(Q29=\"OK\",$L$17&\" \"&$M$17&\" \"&TEXT($N$17,\"dd/mm/yy\"),\"\")","v":""},{"$f":"N29","v":""},{"$f":"'IMPREST CLAIM'!H12","v":0},{"$f":"IF(OR(Z29=\"\",,E29=\"\",J29=\"\"),\"Blank\",\"OK\")","v":"Blank"},null,null,null,null,null,null,null,null,{"$f":"IF('IMPREST CLAIM'!F12=0,\"\",'IMPREST CLAIM'!F12)","v":""}]
[null,1,"GL",{"$f":"UPPER(Z30)","v":""},{"$f":"IF('IMPREST CLAIM'!E13=0,\"\",'IMPREST CLAIM'!E13)","v":""},null,null,{"$f":"IF('IMPREST CLAIM'!L13=0,\"\",'IMPREST CLAIM'!L13)","v":""},null,{"$f":"IF('IMPREST CLAIM'!G13=\"\",\"\",IF('IMPREST CLAIM'!G13=\"P0\",\"0\",'IMPREST CLAIM'!G13))","v":""},null,{"$f":"TODAY()","v":"2025-02-25"},{"$f":"'IMPREST CLAIM'!$A$7","v":0},{"$f":"IF(Q30=\"OK\",$L$17&\" \"&$M$17&\" \"&TEXT($N$17,\"dd/mm/yy\"),\"\")","v":""},{"$f":"N30","v":""},{"$f":"'IMPREST CLAIM'!H13","v":0},{"$f":"IF(OR(Z30=\"\",,E30=\"\",J30=\"\"),\"Blank\",\"OK\")","v":"Blank"},null,null,null,null,null,null,null,null,{"$f":"IF('IMPREST CLAIM'!F13=0,\"\",'IMPREST CLAIM'!F13)","v":""}]
{"$rows_left_out":1139}
{"sheet":"Reconciliation","index":4,"n_rows":42,"n_cols":5,"rows_kept":42,"cut":false,"hidden":false,"merged":[[38,4,38,7],[39,4,39,7],[40,4,40,7],[41,4,41,7]]}
[]
[null,null,null,"Establishment :"]
[]
[null,null,null,"Reconciliation to :-",{"$f":"'IMPREST CLAIM'!F6","v":"00:00:00"}]
[]
[null,null,null,null,"£"]
[]
[null,null,null,"Total Expenditure from Imprest Claim",{"$f":"'IMPREST CLAIM'!H9","v":0}]
[]
[null,null,null,"Add:"]
[]
[null,null,null,"Balance from Bank Statement at end of",0]
[null,null,null,"Period  "]
[]
[null,null,null,"Less Unpresented Cheques (from list)",{"$f":"'Unpresented cheque list'!F38","v":0}]
[]
[null,null,null,"Cash in Hand",0]
[]
[null,null,null,"Claims not yet reimbursed and still",0]
[null,null,null,"outstanding"]
[]
[]
[null,null,null,"Total of Imprest after Refund",{"$f":"SUM(E8:E13)+SUM(E17:E21)-E15","v":0}]
[null,null,null,"(This should agree to total imprest balance)"]
[]
[]
[null,null,null,"Prepared By:- "]
[null,null,null,"Contact Telephone No:-"]
[]
[null,null,null,"Certification"]
{"$rows_left_out":13}
{"sheet":"Unpresented cheque list","index":5,"n_rows":38,"n_cols":6,"rows_kept":38,"cut":false,"hidden":false,"merged":[]}
[null,null,"Cheque number","Date of cheque","Payee","Amount"]
[]
[]
[]
[]
[]
[]
[]
[]
[]
[]
[]
[]
[]
[]
[]
[]
[]
[]
[]
[]
[]
[]
[]
[]
[]
[]
[]
[]
[]
{"$rows_left_out":9}
{"sheet":"_GL07_55","index":6,"n_rows":67,"n_cols":7,"rows_kept":67,"cut":false,"hidden":true,"merged":[]}
["Field Name","Width","Mandatory","Right Justify","Format","Multiplier"]
["batch_id",25,"",""]
["interface",25]
["voucher_type",25,"",""]
["trans_type",2,"",""]
["client",25,"",""]
["account",25,"",""]
["dim_1",25,"",""]
["dim_2",25,"",""]
["dim_3",25,"",""]
["dim_4",25,"",""]
["dim_5",25,"",""]
["dim_6",25,"",""]
["dim_7",25,"",""]
["tax_code",25,"",""]
["tax_system",25]
["currency",25,"",""]
["dc_flag",2]
["cur_amount",20,"","Y","0","100"]
["amount",20,"","Y","0","100"]
["number_1",11,"","Y","0"]
["value_1",20,"","Y","0","100"]
["value_2",20,null,"Y","0","100"]
["value_3",20,null,"Y","0","100"]
["description",255,"",""]
["trans_date",8,"","","yyyymmdd"]
["voucher_date",8,"","","yyyymmdd"]
["voucher_no",15,"",""]
["period",6,"",""]
["tax_id",1]
{"$rows_left_out":37}